{"text_format":"1","workbook":"xlsx","n_sheets":8,"sheets":["Calculator","Rebundled Rates","Rates","Data & Calculations","RC PasteDataHere","RC Calculations","RC Results","Changelog"],"not_rendered":{"charts":0,"images":1,"macros":1,"external_links":0,"defined_names":1,"comments":0,"pivot_tables":0},"unopened":[],"bounds":{"document_bytes":16777216,"sheet_cells":100000,"rows_first":2000,"rows_last":500,"rows_between":2000,"halvings":0,"cell_chars":16384,"cell_head_chars":4096},"cells_cut":0,"cells_raw":0,"read":"whole","date_system":"1900"}

{"sheet":"Calculator","index":0,"n_rows":46,"n_cols":9,"rows_kept":46,"cut":false,"hidden":false,"merged":[[3,2,3,7],[7,2,7,7],[28,2,28,7],[31,2,31,7],[37,2,37,7]]}
[]
[]
[null,null,"Residential Cost Comparison Calculator",null,null,null,null,null,"Updated 3/5/19"]
[]
[]
[null,null,{"$f":"IF(ISNUMBER(SEARCH(\"-1\",D9)),\"Enter Your Total Monthly Usage (kWh)\",\"\")","v":"Enter Your Total Monthly Usage (kWh)"},null,"Select Your Billing Month","May-Oct"]
[null,null,"                   (usage details can typically be found on the third page of your bill)",null,"           (select which range of months your bill falls in)"]
[null,null,"Additional Rate Options"]
{"$rows_left_out":39}
{"sheet":"Rebundled Rates","index":1,"n_rows":56,"n_cols":14,"rows_kept":56,"cut":false,"hidden":true,"merged":[[47,0,47,13],[48,3,48,6],[48,10,48,13],[20,10,20,13],[20,3,20,6],[26,3,26,6],[26,10,26,13],[34,3,34,6],[34,10,34,13],[42,3,42,6],[42,10,42,13],[1,3,1,6],[0,1,0,6],[0,8,0,13],[1,10,1,13],[6,3,6,6],[6,10,6,13]]}
[null,"Rates for Usage",null,null,null,null,null,null,"Rates for Surplus Generation (Excess NEM Credits at billing date)"]
[{"$f":"Rates!A3","v":"Basic Residential (E-1)"},"SCP Rebundled","PG&E Bundled","Result",null,null,null,null,"SCP Rebundled","PG&E Bundled","Result"]
["Up to Baseline",{"$f":"C3-VLOOKUP($A$2,Rates!$A$23:$H$38,2,0)+VLOOKUP($A$2,Rates!$A$41:$H$56,2,0)+VLOOKUP(MAX('Data & Calculations'!$A$40:$A$46),'Data & Calculations'!$A$40:$D$46,4,0)","v":0.20932999999999999},{"$f":"VLOOKUP(A$2,Rates!$A$2:$AB$20,2,0)","v":0.21775},"SCP's rate is",{"$f":"IF(B3<C3,\"lower by\",\"higher by\")","v":"lower by"},{"$f":"ABS(C3-B3)","v":8.4200000000000108E-3},"per kWh",null,{"$f":"B3+0.01","v":0.21933},{"$f":"C3","v":0.21775},"SCP's rate is",{"$f":"IF(I3<J3,\"lower by\",\"higher by\")","v":"higher by"},{"$f":"ABS(J3-I3)","v":1.5799999999999981E-3},"per kWh"]
["100%-200% of Baseline",{"$f":"C4-VLOOKUP($A$2,Rates!$A$23:$H$38,2,0)+VLOOKUP($A$2,Rates!$A$41:$H$56,2,0)+VLOOKUP(MAX('Data & Calculations'!$A$40:$A$46),'Data & Calculations'!$A$40:$D$46,4,0)","v":0.2656},{"$f":"VLOOKUP(A$2,Rates!$A$2:$AB$20,12,0)","v":0.27401999999999999},"SCP's rate is",{"$f":"IF(B4<C4,\"lower by\",\"higher by\")","v":"lower by"},{"$f":"ABS(C4-B4)","v":8.4199999999999831E-3},"per kWh",null,{"$f":"B4+0.01","v":0.27560000000000001},{"$f":"C4","v":0.27401999999999999},"SCP's rate is",{"$f":"IF(I4<J4,\"lower by\",\"higher by\")","v":"higher by"},{"$f":"ABS(J4-I4)","v":1.5800000000000258E-3},"per kWh"]
["High Usage (over 400%)",{"$f":"C5-VLOOKUP($A$2,Rates!$A$23:$H$38,2,0)+VLOOKUP($A$2,Rates!$A$41:$H$56,2,0)+VLOOKUP(MAX('Data & Calculations'!$A$40:$A$46),'Data & Calculations'!$A$40:$D$46,4,0)","v":0.47167000000000003},{"$f":"VLOOKUP(A$2,Rates!$A$2:$AB$20,21,0)","v":0.48009000000000002},"SCP's rate is","lower by",8.4199999999999831E-3,"per kWh",null,0.48167000000000004,0.48009000000000002,"SCP's rate is","higher by",1.5800000000000258E-3,"per kWh"]
[]
[{"$f":"Rates!A5","v":"E-TOU-A"},"SCP Rebundled","PG&E Bundled","Result",null,null,null,null,"SCP Rebundled","PG&E Bundled","Result"]
["Summer Peak"]
{"$rows_left_out":49}
{"sheet":"Rates","index":2,"n_rows":55,"n_cols":29,"rows_kept":55,"cut":false,"hidden":true,"merged":[]}
["Bundled Rate"]
["Tier 1","All Usage","Summer Peak","Summer Partial Peak","Summer Off Peak","Winter Peak","Winter Partial Peak","Winter Off Peak","Meter Charge","Minimum Bill","Tier 2","All Usage","S Pk","S Pt","S Off","W Pk","W Pt","W Off",null,"High Usage","All Usage","S Pk","S Pt","S Off","W Pk","W Pt","W Off",null,"Baseline"]
["Basic Residential (E-1)",0.21775,false,false,false,false,false,false,null,0.32854,{"$f":"A3","v":"Basic Residential (E-1)"},0.27401999999999999,false,false,false,false,false,false,null,{"$f":"K3","v":"Basic Residential (E-1)"},0.48009000000000002,false,false,false,false,false,false,null,"Standard"]
["Basic CARE Res. (EL-1)",0.13947000000000001,false,false,false,false,false,false,null,0.16427,{"$f":"A4","v":"Basic CARE Res. (EL-1)"},0.17527999999999999,false,false,false,false,false,false,null,"Basic CARE Res. (EL-1)",0.30708999999999997,false,false,false,false,false,false,null,"Standard"]
["E-TOU-A",{"$f":"L5","v":false},{"$f":"M5+$D$19","v":0.31732000000000005},{"$f":"N5","v":false},{"$f":"O5+D19","v":0.24173999999999998},{"$f":"P5+D19","v":0.19933999999999999},false,{"$f":"R5+D19","v":0.18505000000000002},null,{"$f":"J3","v":0.32854},{"$f":"A5","v":"E-TOU-A"},false,0.39733000000000002,false,0.32174999999999998,0.27934999999999999,false,0.26506000000000002,null,"E-TOU-A",false,0.39733000000000002,false,0.32174999999999998,0.27934999999999999,false,0.26506000000000002,null,"TOU"]
["E-TOU-B",{"$f":"L6","v":false},{"$f":"M6","v":0.37522},false,0.27216000000000001,0.23774000000000001,false,0.21894,null,{"$f":"J3","v":0.32854},"E-TOU-B",false,0.37522,false,0.27216000000000001,0.23774000000000001,false,0.21894,null,"E-TOU-B",false,0.37522,false,0.27216000000000001,0.23774000000000001,false,0.21894,null,"TOU"]
["E-TOU-C3",false,{"$f":"M7+$D$19","v":0.29483000000000004},false,{"$f":"O7+$D$19","v":0.23139000000000001},{"$f":"P7+$D$19","v":0.20774000000000001},false,{"$f":"R7+$D$19","v":0.19041},null,{"$f":"J3","v":0.32854},"E-TOU-C3",false,0.37484000000000001,false,0.31140000000000001,0.28775000000000001,false,0.27041999999999999,null,"E-TOU-C3",{"$f":"L7","v":false},0.37484000000000001,false,0.31140000000000001,0.28775000000000001,false,0.27041999999999999,null,"TOU"]
["EL-TOU-A (CARE)",{"$f":"L8","v":false},{"$f":"M8+D20","v":0.20371},false,{"$f":"O8+D20","v":0.15609999999999999},{"$f":"P8+D20","v":0.12938},false,{"$f":"R8+D20","v":0.12037999999999999},null,{"$f":"J4","v":0.16427},"EL-TOU-A (CARE)",false,0.24348,false,0.19586999999999999,0.16914999999999999,false,0.16014999999999999,null,"EL-TOU-A (CARE)",false,0.24348,false,0.19586999999999999,0.16914999999999999,false,0.16014999999999999,null,"TOU"]
{"$rows_left_out":48}
{"sheet":"Data & Calculations","index":3,"n_rows":80,"n_cols":10,"rows_kept":80,"cut":false,"hidden":true,"merged":[]}
["Determined Bundled Rate (automated)"]
[{"$f":"Calculator!D9","v":"Basic Residential (E-1)"},{"$f":"Rates!B2","v":"All Usage"},{"$f":"Rates!C2","v":"Summer Peak"},{"$f":"Rates!D2","v":"Summer Partial Peak"},{"$f":"Rates!E2","v":"Summer Off Peak"},{"$f":"Rates!F2","v":"Winter Peak"},{"$f":"Rates!G2","v":"Winter Partial Peak"},{"$f":"Rates!H2","v":"Winter Off Peak"},{"$f":"Rates!I2","v":"Meter Charge"},{"$f":"Rates!J2","v":"Minimum Bill"}]
["Tier 1",{"$f":"VLOOKUP(Calculator!$D$9,Rates!$A$3:$AB$18,MATCH(B$2,Rates!$A$2:$J$2,0),FALSE)","v":0.21775},{"$f":"VLOOKUP(Calculator!$D$9,Rates!$A$3:$AB$18,MATCH(C$2,Rates!$A$2:$J$2,0),FALSE)","v":false},{"$f":"VLOOKUP(Calculator!$D$9,Rates!$A$3:$AB$18,MATCH(D$2,Rates!$A$2:$J$2,0),FALSE)","v":false},{"$f":"VLOOKUP(Calculator!$D$9,Rates!$A$3:$AB$18,MATCH(E$2,Rates!$A$2:$J$2,0),FALSE)","v":false},{"$f":"VLOOKUP(Calculator!$D$9,Rates!$A$3:$AB$18,MATCH(F$2,Rates!$A$2:$J$2,0),FALSE)","v":false},{"$f":"VLOOKUP(Calculator!$D$9,Rates!$A$3:$AB$18,MATCH(G$2,Rates!$A$2:$J$2,0),FALSE)","v":false},{"$f":"VLOOKUP(Calculator!$D$9,Rates!$A$3:$AB$18,MATCH(H$2,Rates!$A$2:$J$2,0),FALSE)","v":false},{"$f":"IFERROR(VLOOKUP(Calculator!$D$9,Rates!$A$3:$AB$18,MATCH(I$2,Rates!$A$2:$J$2,0),FALSE),0)","v":0},{"$f":"IFERROR(VLOOKUP(Calculator!$D$9,Rates!$A$3:$AB$18,MATCH(J2,Rates!$A$2:$J$2,0),FALSE),0)","v":0.32854}]
["Tier 2",{"$f":"VLOOKUP(Calculator!$D$9,Rates!$A$3:$AB$18,MATCH(B$2,Rates!$A$2:$J$2,0)+10,FALSE)","v":0.27401999999999999},{"$f":"VLOOKUP(Calculator!$D$9,Rates!$A$3:$AB$18,MATCH(C$2,Rates!$A$2:$J$2,0)+10,FALSE)","v":false},{"$f":"VLOOKUP(Calculator!$D$9,Rates!$A$3:$AB$18,MATCH(D$2,Rates!$A$2:$J$2,0)+10,FALSE)","v":false},{"$f":"VLOOKUP(Calculator!$D$9,Rates!$A$3:$AB$18,MATCH(E$2,Rates!$A$2:$J$2,0)+10,FALSE)","v":false},{"$f":"VLOOKUP(Calculator!$D$9,Rates!$A$3:$AB$18,MATCH(F$2,Rates!$A$2:$J$2,0)+10,FALSE)","v":false},{"$f":"VLOOKUP(Calculator!$D$9,Rates!$A$3:$AB$18,MATCH(G$2,Rates!$A$2:$J$2,0)+10,FALSE)","v":false},{"$f":"VLOOKUP(Calculator!$D$9,Rates!$A$3:$AB$18,MATCH(H$2,Rates!$A$2:$J$2,0)+10,FALSE)","v":false}]
["Tier 3",{"$f":"VLOOKUP(Calculator!$D$9,Rates!$A$3:$AB$18,MATCH(B$2,Rates!$A$2:$J$2,0)+19,FALSE)","v":0.48009000000000002},{"$f":"VLOOKUP(Calculator!$D$9,Rates!$A$3:$AB$18,MATCH(C$2,Rates!$A$2:$J$2,0)+19,FALSE)","v":false},{"$f":"VLOOKUP(Calculator!$D$9,Rates!$A$3:$AB$18,MATCH(D$2,Rates!$A$2:$J$2,0)+19,FALSE)","v":false},{"$f":"VLOOKUP(Calculator!$D$9,Rates!$A$3:$AB$18,MATCH(E$2,Rates!$A$2:$J$2,0)+19,FALSE)","v":false},{"$f":"VLOOKUP(Calculator!$D$9,Rates!$A$3:$AB$18,MATCH(F$2,Rates!$A$2:$J$2,0)+19,FALSE)","v":false},{"$f":"VLOOKUP(Calculator!$D$9,Rates!$A$3:$AB$18,MATCH(G$2,Rates!$A$2:$J$2,0)+19,FALSE)","v":false},{"$f":"VLOOKUP(Calculator!$D$9,Rates!$A$3:$AB$18,MATCH(H$2,Rates!$A$2:$J$2,0)+19,FALSE)","v":false}]
[]
["Determined Bundled Charges (automated)"]
[{"$f":"A2","v":"Basic Residential (E-1)"},"All Usage","Summer Peak","Summer Partial Peak","Summer Off Peak","Winter Peak","Winter Partial Peak","Winter Off Peak","Meter Charge","Total"]
{"$rows_left_out":73}
{"sheet":"RC PasteDataHere","index":4,"n_rows":0,"n_cols":0,"rows_kept":0,"cut":false,"hidden":true,"merged":[]}

{"sheet":"RC Calculations","index":5,"n_rows":66,"n_cols":28,"rows_kept":66,"cut":false,"hidden":true,"merged":[]}
["Total Usage",{"$f":"SUM('RC PasteDataHere'!E:E)","v":0}]
[]
["E1 Usage Breakdown",null,null,null,null,null,null,"E6 Usage Breakdown",null,null,null,null,null,null,null,"ETOUA",null,null,null,null,"ETOUB",null,null,null,"EVA"]
[null,null,null,null,null,null,null,null,"Peak","Partial","Off",null,null,null,null,null,"Peak","Off",null,null,null,"Peak","Off",null,null,"Peak","Partial","Off"]
["January",{"$f":"SUM(IF(MONTH('RC PasteDataHere'!$B$7:$B$10000)=1,'RC PasteDataHere'!$E$7:$E$10000,0))","v":0},null,null,null,null,null,"January",null,{"$f":"SUM(IF(MONTH('RC PasteDataHere'!$B$7:$B$10000)=1,IF(WEEKDAY('RC PasteDataHere'!$B$7:$B$10000)=1,0,IF(WEEKDAY('RC PasteDataHere'!$B$7:$B$10000)=7,0,IF(HOUR('RC PasteDataHere'!$C$7:$C$10000)>16,IF(HOUR('RC PasteDataHere'!$C$7:$C$10000)<20,'RC PasteDataHere'!$E$7:$E$10000,0),0)))))","v":0},{"$f":"B5-J5","v":0},null,null,null,null,"January",{"$f":"SUM(IF(MONTH('RC PasteDataHere'!$B$7:$B$10000)=1,IF(WEEKDAY('RC PasteDataHere'!$B$7:$B$10000)=1,0,IF(WEEKDAY('RC PasteDataHere'!$B$7:$B$10000)=7,0,IF(HOUR('RC PasteDataHere'!$C$7:$C$10000)>14,IF(HOUR('RC PasteDataHere'!$C$7:$C$10000)<20,'RC PasteDataHere'!$E$7:$E$10000,0),0)))))","v":0},{"$f":"$B5-Q5","v":0},null,null,"January",{"$f":"SUM(IF(MONTH('RC PasteDataHere'!$B$7:$B$10000)=1,IF(WEEKDAY('RC PasteDataHere'!$B$7:$B$10000)=1,0,IF(WEEKDAY('RC PasteDataHere'!$B$7:$B$10000)=7,0,IF(HOUR('RC PasteDataHere'!$C$7:$C$10000)>15,IF(HOUR('RC PasteDataHere'!$C$7:$C$10000)<21,'RC PasteDataHere'!$E$7:$E$10000,0),0)))))","v":0},{"$f":"$B5-V5","v":0},null,"January",{"$f":"SUM(SUM(IF(MONTH('RC PasteDataHere'!$B$7:$B$10000)=1,IF(WEEKDAY('RC PasteDataHere'!$B$7:$B$10000)=1,0,IF(WEEKDAY('RC PasteDataHere'!$B$7:$B$10000)=7,0,IF(HOUR('RC PasteDataHere'!$C$7:$C$10000)>12,IF(HOUR('RC PasteDataHere'!$C$7:$C$10000)<21,'RC PasteDataHere'!$E$7:$E$10000,0),0)))),SUM(IF(MONTH('RC PasteDataHere'!$B$7:$B$10000)=1,IF(WEEKDAY('RC PasteDataHere'!$B$7:$B$10000)=1,IF(HOUR('RC PasteDataHere'!$C$7:$C$10000)>14,IF(HOUR('RC PasteDataHere'!$C$7:$C$10000)<19,'RC PasteDataHere'!$E$7:$E$10000,0),0)))),SUM(IF(MONTH('RC PasteDataHere'!$B$7:$B$10000)=1,IF(WEEKDAY('RC PasteDataHere'!$B$7:$B$10000)=7,IF(HOUR('RC PasteDataHere'!$C$7:$C$10000)>14,IF(HOUR('RC PasteDataHere'!$C$7:$C$10000)<19,'RC PasteDataHere'!$E$7:$E$10000,0),0))))))","v":0},{"$f":"SUM(SUM(IF(MONTH('RC PasteDataHere'!$B$7:$B$10000)=1,IF(WEEKDAY('RC PasteDataHere'!$B$7:$B$10000)=1,0,IF(WEEKDAY('RC PasteDataHere'!$B$7:$B$10000)=7,0,IF(HOUR('RC PasteDataHere'!$C$7:$C$10000)>6,IF(HOUR('RC PasteDataHere'!$C$7:$C$10000)<14,'RC PasteDataHere'!$E$7:$E$10000,0),0)))),SUM(IF(MONTH('RC PasteDataHere'!$B$7:$B$10000)=1,IF(WEEKDAY('RC PasteDataHere'!$B$7:$B$10000)=1,0,IF(WEEKDAY('RC PasteDataHere'!$B$7:$B$10000)=7,0,IF(HOUR('RC PasteDataHere'!$C$7:$C$10000)>20,IF(HOUR('RC PasteDataHere'!$C$7:$C$10000)<23,'RC PasteDataHere'!$E$7:$E$10000,0),0)))))))","v":0},{"$f":"B5-AA5-Z5","v":0}]
["February",{"$f":"SUM(IF(MONTH('RC PasteDataHere'!$B$7:$B$10000)=2,'RC PasteDataHere'!$E$7:$E$10000,0))","v":0},null,null,null,null,null,"February",null,{"$f":"SUM(IF(MONTH('RC PasteDataHere'!$B$7:$B$10000)=2,IF(WEEKDAY('RC PasteDataHere'!$B$7:$B$10000)=1,0,IF(WEEKDAY('RC PasteDataHere'!$B$7:$B$10000)=7,0,IF(HOUR('RC PasteDataHere'!$C$7:$C$10000)>16,IF(HOUR('RC PasteDataHere'!$C$7:$C$10000)<20,'RC PasteDataHere'!$E$7:$E$10000,0),0)))))","v":0},{"$f":"B6-J6","v":0},null,null,null,null,"February",{"$f":"SUM(IF(MONTH('RC PasteDataHere'!$B$7:$B$10000)=2,IF(WEEKDAY('RC PasteDataHere'!$B$7:$B$10000)=1,0,IF(WEEKDAY('RC PasteDataHere'!$B$7:$B$10000)=7,0,IF(HOUR('RC PasteDataHere'!$C$7:$C$10000)>14,IF(HOUR('RC PasteDataHere'!$C$7:$C$10000)<20,'RC PasteDataHere'!$E$7:$E$10000,0),0)))))","v":0},0,null,null,"February",{"$f":"SUM(IF(MONTH('RC PasteDataHere'!$B$7:$B$10000)=2,IF(WEEKDAY('RC PasteDataHere'!$B$7:$B$10000)=1,0,IF(WEEKDAY('RC PasteDataHere'!$B$7:$B$10000)=7,0,IF(HOUR('RC PasteDataHere'!$C$7:$C$10000)>15,IF(HOUR('RC PasteDataHere'!$C$7:$C$10000)<21,'RC PasteDataHere'!$E$7:$E$10000,0),0)))))","v":0},0,null,"February",{"$f":"SUM(SUM(IF(MONTH('RC PasteDataHere'!$B$7:$B$10000)=2,IF(WEEKDAY('RC PasteDataHere'!$B$7:$B$10000)=1,0,IF(WEEKDAY('RC PasteDataHere'!$B$7:$B$10000)=7,0,IF(HOUR('RC PasteDataHere'!$C$7:$C$10000)>12,IF(HOUR('RC PasteDataHere'!$C$7:$C$10000)<21,'RC PasteDataHere'!$E$7:$E$10000,0),0)))),SUM(IF(MONTH('RC PasteDataHere'!$B$7:$B$10000)=2,IF(WEEKDAY('RC PasteDataHere'!$B$7:$B$10000)=1,IF(HOUR('RC PasteDataHere'!$C$7:$C$10000)>14,IF(HOUR('RC PasteDataHere'!$C$7:$C$10000)<19,'RC PasteDataHere'!$E$7:$E$10000,0),0)))),SUM(IF(MONTH('RC PasteDataHere'!$B$7:$B$10000)=2,IF(WEEKDAY('RC PasteDataHere'!$B$7:$B$10000)=7,IF(HOUR('RC PasteDataHere'!$C$7:$C$10000)>14,IF(HOUR('RC PasteDataHere'!$C$7:$C$10000)<19,'RC PasteDataHere'!$E$7:$E$10000,0),0))))))","v":0},{"$f":"SUM(SUM(IF(MONTH('RC PasteDataHere'!$B$7:$B$10000)=2,IF(WEEKDAY('RC PasteDataHere'!$B$7:$B$10000)=1,0,IF(WEEKDAY('RC PasteDataHere'!$B$7:$B$10000)=7,0,IF(HOUR('RC PasteDataHere'!$C$7:$C$10000)>6,IF(HOUR('RC PasteDataHere'!$C$7:$C$10000)<14,'RC PasteDataHere'!$E$7:$E$10000,0),0)))),SUM(IF(MONTH('RC PasteDataHere'!$B$7:$B$10000)=2,IF(WEEKDAY('RC PasteDataHere'!$B$7:$B$10000)=1,0,IF(WEEKDAY('RC PasteDataHere'!$B$7:$B$10000)=7,0,IF(HOUR('RC PasteDataHere'!$C$7:$C$10000)>20,IF(HOUR('RC PasteDataHere'!$C$7:$C$10000)<23,'RC PasteDataHere'!$E$7:$E$10000,0),0)))))))","v":0},0]
["March",{"$f":"SUM(IF(MONTH('RC PasteDataHere'!$B$7:$B$10000)=3,'RC PasteDataHere'!$E$7:$E$10000,0))","v":0},null,null,null,null,null,"March",null,{"$f":"SUM(IF(MONTH('RC PasteDataHere'!$B$7:$B$10000)=3,IF(WEEKDAY('RC PasteDataHere'!$B$7:$B$10000)=1,0,IF(WEEKDAY('RC PasteDataHere'!$B$7:$B$10000)=7,0,IF(HOUR('RC PasteDataHere'!$C$7:$C$10000)>16,IF(HOUR('RC PasteDataHere'!$C$7:$C$10000)<20,'RC PasteDataHere'!$E$7:$E$10000,0),0)))))","v":0},{"$f":"B7-J7","v":0},null,null,null,null,"March",{"$f":"SUM(IF(MONTH('RC PasteDataHere'!$B$7:$B$10000)=3,IF(WEEKDAY('RC PasteDataHere'!$B$7:$B$10000)=1,0,IF(WEEKDAY('RC PasteDataHere'!$B$7:$B$10000)=7,0,IF(HOUR('RC PasteDataHere'!$C$7:$C$10000)>14,IF(HOUR('RC PasteDataHere'!$C$7:$C$10000)<20,'RC PasteDataHere'!$E$7:$E$10000,0),0)))))","v":0},0,null,null,"March",{"$f":"SUM(IF(MONTH('RC PasteDataHere'!$B$7:$B$10000)=3,IF(WEEKDAY('RC PasteDataHere'!$B$7:$B$10000)=1,0,IF(WEEKDAY('RC PasteDataHere'!$B$7:$B$10000)=7,0,IF(HOUR('RC PasteDataHere'!$C$7:$C$10000)>15,IF(HOUR('RC PasteDataHere'!$C$7:$C$10000)<21,'RC PasteDataHere'!$E$7:$E$10000,0),0)))))","v":0},0,null,"March",{"$f":"SUM(SUM(IF(MONTH('RC PasteDataHere'!$B$7:$B$10000)=3,IF(WEEKDAY('RC PasteDataHere'!$B$7:$B$10000)=1,0,IF(WEEKDAY('RC PasteDataHere'!$B$7:$B$10000)=7,0,IF(HOUR('RC PasteDataHere'!$C$7:$C$10000)>12,IF(HOUR('RC PasteDataHere'!$C$7:$C$10000)<21,'RC PasteDataHere'!$E$7:$E$10000,0),0)))),SUM(IF(MONTH('RC PasteDataHere'!$B$7:$B$10000)=3,IF(WEEKDAY('RC PasteDataHere'!$B$7:$B$10000)=1,IF(HOUR('RC PasteDataHere'!$C$7:$C$10000)>14,IF(HOUR('RC PasteDataHere'!$C$7:$C$10000)<19,'RC PasteDataHere'!$E$7:$E$10000,0),0)))),SUM(IF(MONTH('RC PasteDataHere'!$B$7:$B$10000)=3,IF(WEEKDAY('RC PasteDataHere'!$B$7:$B$10000)=7,IF(HOUR('RC PasteDataHere'!$C$7:$C$10000)>14,IF(HOUR('RC PasteDataHere'!$C$7:$C$10000)<19,'RC PasteDataHere'!$E$7:$E$10000,0),0))))))","v":0},{"$f":"SUM(SUM(IF(MONTH('RC PasteDataHere'!$B$7:$B$10000)=3,IF(WEEKDAY('RC PasteDataHere'!$B$7:$B$10000)=1,0,IF(WEEKDAY('RC PasteDataHere'!$B$7:$B$10000)=7,0,IF(HOUR('RC PasteDataHere'!$C$7:$C$10000)>6,IF(HOUR('RC PasteDataHere'!$C$7:$C$10000)<14,'RC PasteDataHere'!$E$7:$E$10000,0),0)))),SUM(IF(MONTH('RC PasteDataHere'!$B$7:$B$10000)=3,IF(WEEKDAY('RC PasteDataHere'!$B$7:$B$10000)=1,0,IF(WEEKDAY('RC PasteDataHere'!$B$7:$B$10000)=7,0,IF(HOUR('RC PasteDataHere'!$C$7:$C$10000)>20,IF(HOUR('RC PasteDataHere'!$C$7:$C$10000)<23,'RC PasteDataHere'!$E$7:$E$10000,0),0)))))))","v":0},0]
["April",{"$f":"SUM(IF(MONTH('RC PasteDataHere'!$B$7:$B$10000)=4,'RC PasteDataHere'!$E$7:$E$10000,0))","v":0},null,null,null,null,null,"April",null,{"$f":"SUM(IF(MONTH('RC PasteDataHere'!$B$7:$B$10000)=4,IF(WEEKDAY('RC PasteDataHere'!$B$7:$B$10000)=1,0,IF(WEEKDAY('RC PasteDataHere'!$B$7:$B$10000)=7,0,IF(HOUR('RC PasteDataHere'!$C$7:$C$10000)>16,IF(HOUR('RC PasteDataHere'!$C$7:$C$10000)<20,'RC PasteDataHere'!$E$7:$E$10000,0),0)))))","v":0},{"$f":"B8-J8","v":0},null,null,null,null,"April",{"$f":"SUM(IF(MONTH('RC PasteDataHere'!$B$7:$B$10000)=4,IF(WEEKDAY('RC PasteDataHere'!$B$7:$B$10000)=1,0,IF(WEEKDAY('RC PasteDataHere'!$B$7:$B$10000)=7,0,IF(HOUR('RC PasteDataHere'!$C$7:$C$10000)>14,IF(HOUR('RC PasteDataHere'!$C$7:$C$10000)<20,'RC PasteDataHere'!$E$7:$E$10000,0),0)))))","v":0},0,null,null,"April",{"$f":"SUM(IF(MONTH('RC PasteDataHere'!$B$7:$B$10000)=4,IF(WEEKDAY('RC PasteDataHere'!$B$7:$B$10000)=1,0,IF(WEEKDAY('RC PasteDataHere'!$B$7:$B$10000)=7,0,IF(HOUR('RC PasteDataHere'!$C$7:$C$10000)>15,IF(HOUR('RC PasteDataHere'!$C$7:$C$10000)<21,'RC PasteDataHere'!$E$7:$E$10000,0),0)))))","v":0},0,null,"April",{"$f":"SUM(SUM(IF(MONTH('RC PasteDataHere'!$B$7:$B$10000)=4,IF(WEEKDAY('RC PasteDataHere'!$B$7:$B$10000)=1,0,IF(WEEKDAY('RC PasteDataHere'!$B$7:$B$10000)=7,0,IF(HOUR('RC PasteDataHere'!$C$7:$C$10000)>12,IF(HOUR('RC PasteDataHere'!$C$7:$C$10000)<21,'RC PasteDataHere'!$E$7:$E$10000,0),0)))),SUM(IF(MONTH('RC PasteDataHere'!$B$7:$B$10000)=4,IF(WEEKDAY('RC PasteDataHere'!$B$7:$B$10000)=1,IF(HOUR('RC PasteDataHere'!$C$7:$C$10000)>14,IF(HOUR('RC PasteDataHere'!$C$7:$C$10000)<19,'RC PasteDataHere'!$E$7:$E$10000,0),0)))),SUM(IF(MONTH('RC PasteDataHere'!$B$7:$B$10000)=4,IF(WEEKDAY('RC PasteDataHere'!$B$7:$B$10000)=7,IF(HOUR('RC PasteDataHere'!$C$7:$C$10000)>14,IF(HOUR('RC PasteDataHere'!$C$7:$C$10000)<19,'RC PasteDataHere'!$E$7:$E$10000,0),0))))))","v":0},{"$f":"SUM(SUM(IF(MONTH('RC PasteDataHere'!$B$7:$B$10000)=4,IF(WEEKDAY('RC PasteDataHere'!$B$7:$B$10000)=1,0,IF(WEEKDAY('RC PasteDataHere'!$B$7:$B$10000)=7,0,IF(HOUR('RC PasteDataHere'!$C$7:$C$10000)>6,IF(HOUR('RC PasteDataHere'!$C$7:$C$10000)<14,'RC PasteDataHere'!$E$7:$E$10000,0),0)))),SUM(IF(MONTH('RC PasteDataHere'!$B$7:$B$10000)=4,IF(WEEKDAY('RC PasteDataHere'!$B$7:$B$10000)=1,0,IF(WEEKDAY('RC PasteDataHere'!$B$7:$B$10000)=7,0,IF(HOUR('RC PasteDataHere'!$C$7:$C$10000)>20,IF(HOUR('RC PasteDataHere'!$C$7:$C$10000)<23,'RC PasteDataHere'!$E$7:$E$10000,0),0)))))))","v":0},0]
{"$rows_left_out":59}
{"sheet":"RC Results","index":6,"n_rows":14,"n_cols":6,"rows_kept":14,"cut":false,"hidden":true,"merged":[]}
[{"$f":"'RC PasteDataHere'!A1","v":0},{"$f":"'RC PasteDataHere'!B1","v":0},null,"Instructions:",null,"Download Green Button data from PG&E for a 12 month period."]
[{"$f":"'RC PasteDataHere'!A2","v":0},{"$f":"'RC PasteDataHere'!B2","v":0},null,null,null,"Paste into the appropriate tab below."]
[{"$f":"'RC PasteDataHere'!A3","v":0},{"$f":"'RC PasteDataHere'!B3","v":0},null,null,null,"Select the customer's baseline (geography and heating source) in cell B5."]
[{"$f":"'RC PasteDataHere'!A4","v":0},{"$f":"'RC PasteDataHere'!B4","v":0},null,null,null,"Review results."]
["Customer Baseline","XB"]
[null,null,null,"Disclaimers:",null,"These estimates assume a billing period from the first to the last of each calendar month."]
[null,null,null,null,null,"Actual bill cycles may slightly change these results due to tiering."]
[null,null,null,null,null,"Holidays are not identified by this calculator, so their usage is not exempted and treated as off peak."]
{"$rows_left_out":7}
{"sheet":"Changelog","index":7,"n_rows":15,"n_cols":2,"rows_kept":15,"cut":false,"hidden":true,"merged":[]}
["Date","Change"]
["2016-04-29","Beta version completed, to staff for review."]
["2016-05-04","Cosmetic Changes"]
[null,"Corrected EV rate description"]
[null,"Hid and locked cell editing for public use to restrict potentially breaking calculations"]
["2016-05-23","Replaced IFNA command with IFERROR; IFNA is not well supported in Excel. May need to replace with IF(ISERROR()) later."]
["2016-11-15","Rebundled Rates Added"]
["2017-01-03","Updated for PG&E AET"]
{"$rows_left_out":7}